{"text_format":"1","workbook":"xlsx","n_sheets":8,"sheets":["Stump Analysis Data","Seedling Data","Taper Data","Height-Age","Output 3","DUB-DBH(OB)","DBH(OB)-Age","Final Graph"],"not_rendered":{"charts":18,"images":0,"macros":1,"external_links":0,"defined_names":3,"comments":1,"pivot_tables":0},"unopened":[],"bounds":{"document_bytes":16777216,"sheet_cells":100000,"rows_first":2000,"rows_last":500,"rows_between":2000,"halvings":0,"cell_chars":16384,"cell_head_chars":4096},"cells_cut":0,"cells_raw":0,"read":"whole","date_system":"1900"}

{"sheet":"Stump Analysis Data","index":0,"n_rows":20,"n_cols":25,"rows_kept":20,"cut":false,"hidden":false,"merged":[[1,9,1,14],[0,0,2,7],[0,9,0,14],[7,1,8,1],[2,18,2,20],[3,13,3,14],[7,3,8,3],[7,4,8,4],[7,2,8,2],[7,5,7,24]]}
["Instructions:\n1. First reset the sheet using the button Reset Sheet\n2. Enter the number of groups in the cell highlighted below\n3. Prepare the sheet by using the button Prepare Sheet\n4. Enter the data and move on to the next sheet Seedling Data\n\n*Please enter values only in cells that are highlighted in GREY",null,null,null,null,null,null,null,null,"Data of Stump Analysis"]
[null,null,null,null,null,null,null,null,null,"Diameter at successive Decades",null,null,null,null,null,null,null,null,"Species:-","Shorea Robusta"]
[]
[]
[]
[null,"No of groups in the class",null,null,11]
[]
[null,"Row Status","Group No.","Stump Height (cm)","G(ob) Stumps","Average diameter of decades in cms"]
[null,null,null,null,null,"1\n(10 yrs)","2\n(20 yrs)","3\n(30 yrs)","4\n(40 yrs)","5\n(50 yrs)","6\n(60 yrs)","7\n(70 yrs)","8\n(80 yrs)","9\n(90 yrs)","10\n(100 yrs)","11\n(110 yrs)","12\n(120 yrs)","13\n(130 yrs)","14\n(140 yrs)","15\n(150 yrs)","16\n(160 yrs)","17\n(170 yrs)","18\n(180 yrs)","19\n(190 yrs)","20\n(200 yrs)"]
[null,"Active",1]
[null,"Active",2]
[null,"Active",3]
[null,"Active",4]
[null,"Active",5]
[null,"Active",6]
{"$rows_left_out":6}
{"sheet":"Seedling Data","index":1,"n_rows":24,"n_cols":31,"rows_kept":24,"cut":false,"hidden":false,"merged":[[0,0,2,9],[12,29,12,30],[11,1,13,1],[11,2,13,2],[11,3,11,30],[12,3,12,4],[12,5,12,6],[12,7,12,8],[12,9,12,10],[12,11,12,12],[12,13,12,14],[12,15,12,16],[12,17,12,18],[12,19,12,20],[12,21,12,22],[12,25,12,26],[12,23,12,24],[12,27,12,28],[23,1,23,2],[22,1,22,2]]}
["Instructions:\n1. First reset the sheet using the button Reset Sheet\n2. Prepare the sheet by using the button Prepare Sheet\n3. Enter the data and move on to the next sheet Taper Data\n\n*Please enter values only in cells that are highlighted in GREY"]
[null,null,null,null,null,null,null,null,null,null,null,null,null,null,"Stump analysis - Seedling Data"]
[null,null,null,null,null,null,null,null,null,null,null,null,null,null,null,null,null,null,null,null,null,null,null,null,null,null,null,"Species:",{"$f":"'Stump Analysis Data'!T2","v":"Shorea Robusta"}]
[]
[]
[]
[]
[null,"No of groups in the class",null,null,{"$f":"'Stump Analysis Data'!E6","v":11}]
[]
[]
[]
[null,"Row Status","Group no.","Age at successive heights from ground level"]
[null,null,null,"Ground level",null,"10 cm",null,"20 cm",null,"30 cm",null,"40 cm",null,"50 cm",null,"60 cm",null,"70 cm",null,"80 cm",null,"100 cm",null,"120 cm",null,"140 cm",null,"160 cm",null,"180 cm"]
[null,null,null,"Rings","Age","Rings","Age","Rings","Age","Rings","Age","Rings","Age","Rings","Age","Rings","Age","Rings","Age","Rings","Age","Rings","Age","Rings","Age","Rings","Age","Rings","Age","Rings","Age"]
[null,"Active",1,25,0,25,{"$f":"D15-F15+E15","v":0},24,{"$f":"F15-H15+G15","v":1},23,{"$f":"H15-J15+I15","v":2},23,{"$f":"J15-L15+K15","v":2},22,{"$f":"L15-N15+M15","v":3},22,{"$f":"N15-P15+O15","v":3},21,{"$f":"P15-R15+Q15","v":4},20,{"$f":"R15-T15+S15","v":5},19,{"$f":"T15-V15+U15","v":6},18,{"$f":"V15-X15+W15","v":7},17,{"$f":"X15-Z15+Y15","v":8},16,{"$f":"Z15-AB15+AA15","v":9},14,{"$f":"AB15-AD15+AC15","v":11}]
{"$rows_left_out":10}
{"sheet":"Taper Data","index":2,"n_rows":23,"n_cols":49,"rows_kept":23,"cut":false,"hidden":false,"merged":[[8,25,8,28],[8,33,8,36],[8,37,8,40],[8,41,8,44],[11,10,12,10],[11,11,12,11],[8,29,8,32],[11,42,12,42],[11,29,12,29],[11,30,12,30],[11,31,12,31],[11,33,12,33],[11,34,12,34],[11,22,12,22],[11,23,12,23],[9,20,12,20],[11,21,12,21],[6,0,6,3],[8,5,8,8],[8,1,8,4],[11,45,12,45],[8,45,8,48],[9,25,10,27],[9,28,12,28],[9,29,10,31],[9,32,12,32],[9,33,10,35],[9,48,12,48],[11,25,12,25],[11,26,12,26],[11,27,12,27],[11,3,12,3],[11,46,12,46],[11,47,12,47],[11,35,12,35],[11,37,12,37],[11,38,12,38],[11,39,12,39],[11,41,12,41],[11,43,12,43],[9,36,12,36],[9,37,10,39],[9,40,12,40],[9,41,10,43],[9,44,12,44],[9,45,10,47],[9,9,10,11],[11,9,12,9],[9,8,12,8],[8,0,12,0],[9,4,12,4],[11,5,12,5],[11,6,12,6],[9,5,10,7],[9,1,10,3],[11,1,12,1],[11,2,12,2],[11,7,12,7],[8,9,8,12],[9,12,12,12],[0,0,2,9],[8,21,8,24],[4,14,4,15],[11,18,12,18],[9,13,10,15],[11,19,12,19],[8,13,8,16],[8,17,8,20],[9,17,10,19],[9,21,10,23],[9,24,12,24],[11,13,12,13],[11,14,12,14],[11,15,12,15],[9,16,12,16],[11,17,12,17]]}
["Instructions:\n1. First reset the sheet using the button Reset Sheet\n2. Prepare the sheet by using the button Prepare Sheet\n3. Enter the data and press the button Process all data, generate graphs & export to PDF\n\n*Please enter values only in cells that are highlighted in GREY"]
[null,null,null,null,null,null,null,null,null,null,null,null,null,null,null,"Stump Analysis - Taper Data"]
[]
[]
["Species:",null,{"$f":"'Stump Analysis Data'!T2","v":"Shorea Robusta"}]
[]
["No of groups in the class",null,null,null,{"$f":"'Stump Analysis Data'!E6","v":11}]
[]
["Group No.","D.b.h. Class 10-20",null,null,null,"D.b.h. class 20-30",null,null,null,"D.b.h. Class 30-40",null,null,null,"D.b.h. Class 40-50",null,null,null,"D.b.h Class 50-60",null,null,null,"D.b.h. Class 60-70",null,null,null,"D.b.h. Class 70-80",null,null,null,"D.b.h. class 80-90",null,null,null,"D.b.h. Class 90-100",null,null,null,"D.b.h. Class 100-110",null,null,null,"D.b.h Class 110-120",null,null,null,"D.b.h. Class 120-130"]
[null,"Dia. ub",null,null,"D.b.h. o.b.","Dia. Ub",null,null,"D.b.h. o.b.",null,null,null,"D.b.h. o.b.","Dia. ub",null,null,"D.b.h. o.b.",null,null,null,"D.b.h. o.b.","Dia. ub",null,null,"D.b.h. o.b.","Dia. ub",null,null,"D.b.h. o.b.","Dia. Ub",null,null,"D.b.h. o.b.","Dia. Ub",null,null,"D.b.h. o.b.","Dia. ub",null,null,"D.b.h. o.b.","Dia. Ub",null,null,"D.b.h. o.b.","Dia. ub",null,null,"D.b.h. o.b."]
[]
[null,"At 15 cm","At 45 cm","At 75 cm",null,"At 15 cm","At 45 cm","At 75 cm",null,"At 15 cm","At 45 cm","At 75 cm",null,"At 15 cm","At 45 cm","At 75 cm",null,"At 15 cm","At 45 cm","At 75 cm",null,"At 15 cm","At 45 cm","At 75 cm",null,"At        cm","At        cm","At       cm",null,"At        cm","At       cm","At        cm",null,"At        cm","At        cm","At       cm",null,"At         cm","At        cm","At        cm",null,"At          cm","At         cm","At        cm",null,"At         cm","At        cm","At        cm"]
[]
[1,20.100000000000001,18.8,18.3,17.5,29.5,28,26.6,26.8,45.7,41.1,38.4,38.6]
[{"$f":"A14+1","v":2},12.3,11.3,11,11.8,21.9,20.9,20.5,20.2,41.6,37.299999999999997,36.6,37.1]
{"$rows_left_out":9}
{"sheet":"Height-Age","index":3,"n_rows":21,"n_cols":17,"rows_kept":21,"cut":false,"hidden":false,"merged":[[5,8,5,16]]}
[]
[null,"Data of Seedling Data:"]
[]
[null,"No of groups in the class",null,{"$f":"'Stump Analysis Data'!E6","v":11},null,null,null,null,null,null,null,null,null,null,"Age at Breast Height = ",null,9.5212188792092274]
[]
[null,"S No.","Height\n(y axis)\n(in cms)","Age\n(x axis)\n(in years)",null,null,null,null,"Height v/s Age Graph from Consolidated Seedling Data"]
[null,1,0,0]
[null,2,10,1.125]
[null,3,20,2.25]
[null,4,30,3.125]
[null,5,40,3.75]
[null,6,50,4.375]
[null,7,60,5]
[null,8,70,5.875]
[null,9,80,6.625]
{"$rows_left_out":7}
{"sheet":"Output 3","index":4,"n_rows":20,"n_cols":71,"rows_kept":20,"cut":false,"hidden":true,"merged":[[4,66,4,69],[0,0,0,3],[4,30,4,33],[4,36,4,39],[4,42,4,45],[4,48,4,51],[4,54,4,57],[4,60,4,63],[2,0,2,3],[4,0,4,3],[4,6,4,9],[4,12,4,15],[4,18,4,21],[4,24,4,27]]}
["Calculations of Form 3"]
[]
["No of groups in the class",null,null,null,8]
[]
["D.b.h. Class 10-20",null,null,null,null,null,"D.b.h. Class 20-30",null,null,null,null,null,"D.b.h. Class 30-40",null,null,null,null,null,"D.b.h. Class 40-50",null,null,null,null,null,"D.b.h Class 50-60",null,null,null,null,null,"D.b.h. Class 60-70",null,null,null,null,null,"D.b.h. Class 70-80",null,null,null,null,null,"D.b.h. class 80-90",null,null,null,null,null,"D.b.h. Class 90-100",null,null,null,null,null,"D.b.h. Class 100-110",null,null,null,null,null,"D.b.h Class 110-120",null,null,null,null,null,"D.b.h. Class 120-130"]
["DBH",13.25,null,null,null,null,"DBH",25.599999999999998,null,null,null,null,"DBH",38.4,null,null,null,null,"DBH",45.633333333333333,null,null,null,null,"DBH",52.4,null,null,null,null,"DBH",64.466666666666669,null,null,null,null,"DBH",73.5,null,null,null,null,"DBH",83.8,null,null,null,null,"DBH",91.5,null,null,null,null,"DBH",null,null,null,null,null,"DBH",null,null,null,null,null,"DBH"]
[]
[null,"Height","DUB",null,null,null,null,"Height","DUB",null,null,null,null,"Height","DUB",null,null,null,null,"Height","DUB",null,null,null,null,"Height","DUB",null,null,null,null,"Height","DUB",null,null,null,null,"Height","DUB",null,null,null,null,"Height","DUB",null,null,null,null,"Height","DUB",null,null,null,null,"Height","DUB",null,null,null,null,"Height","DUB",null,null,null,null,"Height","DUB"]
[null,"x","y","x*x","x*y",null,null,"x","y","x*x","x*y",null,null,"x","y","x*x","x*y",null,null,"x","y","x*x","x*y",null,null,"x","y","x*x","x*y",null,null,"x","y","x*x","x*y",null,null,"x","y","x*x","x*y",null,null,"x","y","x*x","x*y",null,null,"x","y","x*x","x*y",null,null,"x","y","x*x","x*y",null,null,"x","y","x*x","x*y",null,null,"x","y","x*x","x*y"]
[null,15,15.16666666666667,{"$f":"B10*B10","v":225},{"$f":"B10*C10","v":227.50000000000006},null,null,15,28.666666666666668,{"$f":"H10*H10","v":225},{"$f":"H10*I10","v":430},null,null,15,45.85,{"$f":"N10*N10","v":225},{"$f":"N10*O10","v":687.75},null,null,15,50.65,{"$f":"T10*T10","v":225},{"$f":"T10*U10","v":759.75},null,null,15,58.833333333333336,{"$f":"Z10*Z10","v":225},{"$f":"Z10*AA10","v":882.5},null,null,15,77.466666666666669,{"$f":"AF10*AF10","v":225},{"$f":"AF10*AG10","v":1162},null,null,15,84.55,{"$f":"AL10*AL10","v":225},{"$f":"AL10*AM10","v":1268.25},null,null,15,85.75,{"$f":"AR10*AR10","v":225},{"$f":"AR10*AS10","v":1286.25},null,null,15,100.35,{"$f":"AX10*AX10","v":225},{"$f":"AX10*AY10","v":1505.25},null,null,15,null,{"$f":"BD10*BD10","v":225},{"$f":"BD10*BE10","v":0},null,null,15,null,{"$f":"BJ10*BJ10","v":225},{"$f":"BJ10*BK10","v":0},null,null,15,null,{"$f":"BP10*BP10","v":225},{"$f":"BP10*BQ10","v":0}]
[null,45,14.033333333333333,{"$f":"B11*B11","v":2025},{"$f":"B11*C11","v":631.5},null,null,45,26.466666666666669,{"$f":"H11*H11","v":2025},{"$f":"H11*I11","v":1191},null,null,45,41.2,{"$f":"N11*N11","v":2025},{"$f":"N11*O11","v":1854.0000000000002},null,null,45,46.183333333333337,{"$f":"T11*T11","v":2025},{"$f":"T11*U11","v":2078.25},null,null,45,55.70000000000001,{"$f":"Z11*Z11","v":2025},{"$f":"Z11*AA11","v":2506.5000000000005},null,null,45,73.033333333333331,{"$f":"AF11*AF11","v":2025},{"$f":"AF11*AG11","v":3286.5},null,null,45,75.849999999999994,{"$f":"AL11*AL11","v":2025},{"$f":"AL11*AM11","v":3413.2499999999995},null,null,45,81.650000000000006,{"$f":"AR11*AR11","v":2025},{"$f":"AR11*AS11","v":3674.2500000000005},null,null,45,90,{"$f":"AX11*AX11","v":2025},{"$f":"AX11*AY11","v":4050},null,null,45,null,{"$f":"BD11*BD11","v":2025},{"$f":"BD11*BE11","v":0},null,null,45,null,{"$f":"BJ11*BJ11","v":2025},{"$f":"BJ11*BK11","v":0},null,null,45,null,{"$f":"BP11*BP11","v":2025},{"$f":"BP11*BQ11","v":0}]
[null,75,13.633333333333333,5625,1022.5,null,null,75,25.483333333333334,5625,1911.25,null,null,75,39.133333333333333,5625,2935,null,null,75,44.033333333333331,5625,3302.5,null,null,75,53.133333333333333,5625,3985,null,null,75,67.866666666666674,5625,5090.0000000000009,null,null,75,72.099999999999994,5625,5407.5,null,null,75,79.8,5625,5985,null,null,75,87.800000000000011,5625,6585.0000000000009,null,null,75,null,5625,0,null,null,75,null,5625,0,null,null,75,null,5625,0]
["Sum",{"$f":"SUM(B10:B12)","v":135},{"$f":"SUM(C10:C12)","v":42.833333333333336},7875,1881.5,null,"Sum",{"$f":"SUM(H10:H12)","v":135},{"$f":"SUM(I10:I12)","v":80.616666666666674},{"$f":"SUM(J10:J12)","v":7875},{"$f":"SUM(K10:K12)","v":3532.25},null,"Sum",{"$f":"SUM(N10:N12)","v":135},{"$f":"SUM(O10:O12)","v":126.18333333333334},{"$f":"SUM(P10:P12)","v":7875},{"$f":"SUM(Q10:Q12)","v":5476.75},null,"Sum",{"$f":"SUM(T10:T12)","v":135},{"$f":"SUM(U10:U12)","v":140.86666666666667},{"$f":"SUM(V10:V12)","v":7875},{"$f":"SUM(W10:W12)","v":6140.5},null,"Sum",{"$f":"SUM(Z10:Z12)","v":135},{"$f":"SUM(AA10:AA12)","v":167.66666666666669},{"$f":"SUM(AB10:AB12)","v":7875},{"$f":"SUM(AC10:AC12)","v":7374},null,"Sum",{"$f":"SUM(AF10:AF12)","v":135},{"$f":"SUM(AG10:AG12)","v":218.36666666666667},{"$f":"SUM(AH10:AH12)","v":7875},{"$f":"SUM(AI10:AI12)","v":9538.5},null,"Sum",{"$f":"SUM(AL10:AL12)","v":135},{"$f":"SUM(AM10:AM12)","v":232.49999999999997},{"$f":"SUM(AN10:AN12)","v":7875},{"$f":"SUM(AO10:AO12)","v":10089},null,"Sum",{"$f":"SUM(AR10:AR12)","v":135},{"$f":"SUM(AS10:AS12)","v":247.2},{"$f":"SUM(AT10:AT12)","v":7875},{"$f":"SUM(AU10:AU12)","v":10945.5},null,"Sum",{"$f":"SUM(AX10:AX12)","v":135},{"$f":"SUM(AY10:AY12)","v":278.14999999999998},{"$f":"SUM(AZ10:AZ12)","v":7875},{"$f":"SUM(BA10:BA12)","v":12140.25},null,"Sum",{"$f":"SUM(BD10:BD12)","v":135},{"$f":"SUM(BE10:BE12)","v":0},7875,0,null,"Sum",{"$f":"SUM(BJ10:BJ12)","v":135},{"$f":"SUM(BK10:BK12)","v":0},7875,0,null,"Sum",{"$f":"SUM(BP10:BP12)","v":135},{"$f":"SUM(BQ10:BQ12)","v":0},7875,0]
[]
["Sxx",{"$f":"(3*D13-(B13*B13))/3","v":1800},null,null,null,null,"Sxx",{"$f":"(3*J13-(H13*H13))/3","v":1800},null,null,null,null,"Sxx",{"$f":"(3*P13-(N13*N13))/3","v":1800},null,null,null,null,"Sxx",{"$f":"(3*V13-(T13*T13))/3","v":1800},null,null,null,null,"Sxx",{"$f":"(3*AB13-(Z13*Z13))/3","v":1800},null,null,null,null,"Sxx",{"$f":"(3*AH13-(AF13*AF13))/3","v":1800},null,null,null,null,"Sxx",{"$f":"(3*AN13-(AL13*AL13))/3","v":1800},null,null,null,null,"Sxx",{"$f":"(3*AT13-(AR13*AR13))/3","v":1800},null,null,null,null,"Sxx",{"$f":"(3*AZ13-(AX13*AX13))/3","v":1800},null,null,null,null,"Sxx",{"$f":"(3*BF13-(BD13*BD13))/3","v":1800},null,null,null,null,"Sxx",{"$f":"(3*BL13-(BJ13*BJ13))/3","v":1800},null,null,null,null,"Sxx",{"$f":"(3*BR13-(BP13*BP13))/3","v":1800}]
{"$rows_left_out":6}
{"sheet":"DUB-DBH(OB)","index":5,"n_rows":78,"n_cols":12,"rows_kept":78,"cut":false,"hidden":false,"merged":[[51,6,59,6],[60,6,68,6],[69,6,77,6],[6,6,14,6],[15,6,23,6],[24,6,32,6],[33,6,41,6],[42,6,50,6],[4,11,5,17],[0,0,0,3],[2,0,2,3],[4,0,5,0],[4,1,5,1],[4,6,4,9]]}
["Data for DBH(OB) v/s DUB Graphs"]
[]
["No of groups in the class",null,null,null,{"$f":"'Stump Analysis Data'!E6","v":11},null,"Number of DBH Classes",null,null,{"$f":"COUNT('Taper Data'!B23:AW23)/4","v":9}]
[]
["Group no.","Stump Height (cm)",null,null,null,null,"Graph Data",null,null,null,null,"DBH(OB) v/s DUB Graphs for all Groups"]
[null,null,null,null,null,null,"Group No","DBH Class","DUB\n(X)","DBH(OB)\n(Y)"]
[1,{"$f":"VLOOKUP(A7, 'Stump Analysis Data'!#REF!, 2, 0)","v":{"$error":"#REF!"}},null,null,null,null,1,"0to10",{"$f":"'Output 3'!B17*'DUB-DBH(OB)'!B7+'Output 3'!B18","v":{"$error":"#REF!"}},{"$f":"'Output 3'!B6","v":13.25}]
[{"$f":"A7+1","v":2},{"$f":"VLOOKUP(A8, 'Stump Analysis Data'!#REF!, 2, 0)","v":{"$error":"#REF!"}},null,null,null,null,null,"10to20",{"$f":"'Output 3'!H17*'DUB-DBH(OB)'!B7+'Output 3'!H18","v":{"$error":"#REF!"}},{"$f":"'Output 3'!H6","v":25.599999999999998}]
[3,{"$f":"VLOOKUP(A9, 'Stump Analysis Data'!#REF!, 2, 0)","v":{"$error":"#REF!"}},null,null,null,null,null,"20to30",{"$f":"'Output 3'!N17*'DUB-DBH(OB)'!B7+'Output 3'!N18","v":{"$error":"#REF!"}},{"$f":"'Output 3'!N6","v":38.4}]
[4,{"$f":"VLOOKUP(A10, 'Stump Analysis Data'!#REF!, 2, 0)","v":{"$error":"#REF!"}},null,null,null,null,null,"30to40",{"$f":"'Output 3'!T17*'DUB-DBH(OB)'!B7+'Output 3'!T18","v":{"$error":"#REF!"}},{"$f":"'Output 3'!T6","v":45.633333333333333}]
[5,{"$f":"VLOOKUP(A11, 'Stump Analysis Data'!#REF!, 2, 0)","v":{"$error":"#REF!"}},null,null,null,null,null,"40to50",{"$f":"'Output 3'!Z17*'DUB-DBH(OB)'!B7+'Output 3'!Z18","v":{"$error":"#REF!"}},{"$f":"'Output 3'!Z6","v":52.4}]
[6,{"$f":"VLOOKUP(A12, 'Stump Analysis Data'!#REF!, 2, 0)","v":{"$error":"#REF!"}},null,null,null,null,null,"50to60",{"$f":"'Output 3'!AF17*'DUB-DBH(OB)'!B7+'Output 3'!AF18","v":{"$error":"#REF!"}},{"$f":"'Output 3'!AF6","v":64.466666666666669}]
[7,{"$f":"VLOOKUP(A13, 'Stump Analysis Data'!#REF!, 2, 0)","v":{"$error":"#REF!"}},null,null,null,null,null,"60to70",{"$f":"'Output 3'!AL17*'DUB-DBH(OB)'!B7+'Output 3'!AL18","v":{"$error":"#REF!"}},{"$f":"'Output 3'!AL6","v":73.5}]
[8,{"$f":"VLOOKUP(A14, 'Stump Analysis Data'!#REF!, 2, 0)","v":{"$error":"#REF!"}},null,null,null,null,null,"70to80",{"$f":"'Output 3'!AR17*'DUB-DBH(OB)'!B7+'Output 3'!AR18","v":{"$error":"#REF!"}},{"$f":"'Output 3'!AR6","v":83.8}]
[null,null,null,null,null,null,null,"80to90",{"$f":"'Output 3'!AX17*'DUB-DBH(OB)'!B7+'Output 3'!AX18","v":{"$error":"#REF!"}},{"$f":"'Output 3'!AX6","v":91.5}]
{"$rows_left_out":64}
{"sheet":"DBH(OB)-Age","index":6,"n_rows":99,"n_cols":10,"rows_kept":99,"cut":false,"hidden":false,"merged":[[3,1,3,4],[2,1,2,4],[0,1,0,4],[5,9,5,17]]}
[null,"Data for DBH(OB) v/s Age Graphs"]
[]
[null,"Number of DBH Classes",null,null,null,{"$f":"'DUB-DBH(OB)'!J3","v":9}]
[null,"No of groups in the class",null,null,null,{"$f":"'Stump Analysis Data'!E6","v":11}]
[]
[null,"Group No","No of decades","Age at stump hieght - not corrected\n(years)","DUB at stump hieght\n(in cms)","Stump Height","Age at Breast Hieght","DOB at breast hieght\n(in cms)",null,"DBH(OB) v/s Age Graphs for all Groups"]
[null,1,{"$f":"COUNT('Stump Analysis Data'!#REF!)","v":0},10,5.64,{"$f":"VLOOKUP(B7, 'DUB-DBH(OB)'!A7:B15, 2, 0)","v":{"$error":"#REF!"}},11.325381315862547,5.6158801545314532]
[null,1,null,20,11.54,{"$f":"VLOOKUP(B8, 'DUB-DBH(OB)'!A7:B15, 2, 0)","v":{"$error":"#REF!"}},21.325381315862547,12.50778371784487]
[null,1,null,30,16.600000000000001,{"$f":"VLOOKUP(B9, 'DUB-DBH(OB)'!A7:B15, 2, 0)","v":{"$error":"#REF!"}},31.325381315862547,18.418467112822139]
[null,1,null,40,20.8,{"$f":"VLOOKUP(B10, 'DUB-DBH(OB)'!A7:B15, 2, 0)","v":{"$error":"#REF!"}},41.325381315862543,23.324567954502875]
[null,1,null,50,25,{"$f":"VLOOKUP(B11, 'DUB-DBH(OB)'!A7:B15, 2, 0)","v":{"$error":"#REF!"}},51.325381315862543,28.230668796183611]
[null,1,null,60,29.2,{"$f":"VLOOKUP(B12, 'DUB-DBH(OB)'!A7:B15, 2, 0)","v":{"$error":"#REF!"}},61.325381315862543,33.136769637864347]
[null,1,null,70,32,{"$f":"VLOOKUP(B13, 'DUB-DBH(OB)'!A7:B15, 2, 0)","v":{"$error":"#REF!"}},71.325381315862543,36.407503532318174]
[null,1,null,80,33.6,{"$f":"VLOOKUP(B14, 'DUB-DBH(OB)'!A7:B15, 2, 0)","v":{"$error":"#REF!"}},81.325381315862543,38.276494329148932]
[null,1,null,90,36,{"$f":"VLOOKUP(B15, 'DUB-DBH(OB)'!A7:B15, 2, 0)","v":{"$error":"#REF!"}},91.325381315862543,41.079980524395069]
{"$rows_left_out":85}
{"sheet":"Final Graph","index":7,"n_rows":17,"n_cols":13,"rows_kept":17,"cut":false,"hidden":false,"merged":[[6,12,6,22],[6,10,7,10],[7,2,7,9],[3,1,3,4],[4,1,4,4]]}
[]
[null,"Consolidated Graph of All Groups : DBH(OB) v/s Age"]
[]
[null,"No of groups in the class",null,null,null,{"$f":"'Stump Analysis Data'!E6","v":11}]
[null,"No of decades covered",null,null,null,9]
[]
[null,"Group No.",1,2,3,4,5,6,7,8,"Avg",null,"Consolidated DBH(OB) v/s Age Graph"]
[null,"Age","DBH(OB)"]
[null,10,4.2531911882354372,-0.34463706280934137,-0.34254162490862194,1.3048585907582799,-11.855669773386776,-1.5935073253710552,0.8253879687722705,-7.465624594052084,{"$f":"SUBTOTAL(1, C9:J9)","v":-1.9023178290952363}]
[null,20,11.701641383547077,3.2220900594667778,3.2709836627341806,3.8879811074145341,4.6690876305704734,9.9661537240528268,5.7500961220162647,3.1847954036134105,5.7066036366769435]
[null,30,17.986362802450333,7.5350556158051099,6.8652549862026682,6.6909221499784088,17.332135707387707,18.966907332656465,9.7778218403090786,12.613662509885504,12.221015368084407]
[null,40,23.289062883525972,12.41516902468171,10.477400325038499,9.6912048840539988,26.857171803930846,25.834952666141309,13.102492032608019,20.900269146658655,17.820965345829872]
[null,50,27.791449065354762,17.683339704572649,14.144547658783335,12.866352475245394,33.967893267065804,30.996488890208834,15.918033607870409,28.123907735827313,22.686501550616061]
[null,60,31.675228786517465,23.160477073953977,17.903824966978835,16.193888089156694,39.387997443658492,34.877715170560506,18.418373475053556,34.36387069928594,26.997671963145685]
[null,70,35.122109485594855,28.667490551301768,21.792360229166665,19.651334891391976,43.841181680574849,37.904830672897788,20.797438543114772,39.699450458928979,30.93452456412146]
{"$rows_left_out":2}